{"text_format":"1","workbook":"xlsx","n_sheets":5,"sheets":["Зааварчилгаа","Байгууллагын өөрийн үнэлгээ","Result_1","Result_2","Үнэлгээ тайлбар"],"not_rendered":{"charts":0,"images":1,"macros":1,"external_links":0,"defined_names":9,"comments":0,"pivot_tables":0},"unopened":[],"bounds":{"document_bytes":16777216,"sheet_cells":100000,"rows_first":2000,"rows_last":500,"rows_between":2000,"halvings":0,"cell_chars":16384,"cell_head_chars":4096},"cells_cut":0,"cells_raw":0,"read":"whole","date_system":"1900"}

{"sheet":"Зааварчилгаа","index":0,"n_rows":8,"n_cols":2,"rows_kept":8,"cut":false,"hidden":false,"merged":[[0,0,0,1],[1,0,1,1]]}
["Санхүүгийн зохицуулах хорооны зохицуулалт дахь байгууллагуудын комплайнсын эрсдэлийн үнэлгээний асуулгад хариулах зааварчилгаа"]
["Сайн байна уу, \nКомплайнсын эрсдэлийн өөрийн үнэлгээ хийх зааварчилгааг доор харуулав Үүнд: "]
[1,"Байгууллага комплайнсын эрсдэлийн өөрийн үнэлгээг хийхдээ эксел файлын зааварчилгааны дагуу “The Wolfsberg Group” санхүүгийн байгууллагын комплайнсын эрсдэлийг тодорхойлох 10 бүлэг, 43 багц, 95 асуулт бүхий асуумжид 5 сонголтот хувилбартай хариултуудаас өөрийн байгууллагад тохирохыг сонгоно."]
[2,"Асуулт бүрийн онцлогоос хамаарч хариултын 5 ялгаатай хувилбараас оновчтой 1 хувилбарыг сонгох боломжтой байдлаар асуумж бэлтгэгдсэн. 43 багц асуултуудын зарим хэсэг нь нарийвчилсан байдлаар дэд асуултуудаас бүрдэх бөгөөд дэд асуултууд нэгтгэгдэж 1 багц хариулт, хэд хэдэн багц хариултууд нэгтгэгдэж, 1 бүлгийн үнэлгээ хийгдэх байдлаар 43 багц, 10 бүлэг, 4 төрлийн багц эрсдэл үнэлэгдэнэ."]
[3,"Сонгох хариулт бүтэн харагдахгүй нөхцөлд та тухайн хариултыг дарж бүтнээр нь унших боломжтой."]
[4,"Чанарын асуулгууд заавал сонгох хариулттай тул та аль нэг хариултыг сонгох шаардлагатай. Хариултын сонголт хийгдээгүй тохиолдолд эрсдэлийн үнэлгээ хийгдэхгүй болохыг анхаарна уу."]
[5,"Асуултын хариултаас хамааруулан шаардлагатай тохиолдолд нэмэлт мэдээлэл болон тайлбар оруулах хэсэгт мэдээллээ оруулахыг анхаарна уу. Энэ хэсэгт сонголт хийх боломжгүй, зөвхөн мэдээлэл болон тайлбарыг текстээр оруулна."]
[6,"Мөн тухайн асуултын хувьд эрсдэл гарсан тохиолдолд байгууллагад учирч болзошгүй гарз хохирол буюу байгууллагад үзүүлэх үр нөлөөг 1-5 хүртэл оноогоор (1- маш багаас, 5- маш их үр нөлөөтэй) хэмжиж, үнэлнэ. Комплайнсын эрсдэлийн үр нөлөөг үнэлэх шалгуурыг доор харуулав. Үр нөлөөний шалгуурын дагуу үнэлгээ өгөхдөө хамгийн хялбар байдлаар тухайн асуулт буюу асуудлын хувьд хэдэн үзүүлэлтэд үр нөлөө үзүүлнэ гэж тодорхойлсноос хамааран ижил хувиар үнэлгээг жинлэн тооцох боломжтой."]

{"sheet":"Байгууллагын өөрийн үнэлгээ","index":1,"n_rows":137,"n_cols":4,"rows_kept":137,"cut":false,"hidden":false,"merged":[[136,0,138,3],[17,0,17,2],[81,1,81,2],[96,1,96,2],[85,1,85,2],[1,0,1,3],[119,0,119,2],[60,1,60,2]]}
[]
["Хавсралт 3: Байгууллагын комплайнсын эрсдэлийн өөрийн үнэлгээний асуумж"]
[]
[]
["№","Асуулт ","Хариулт","Эрсдэлийн үр нөлөө"]
["1. ХУУЛИЙН ЭТГЭЭД & ӨМЧИЙН ХЭЛБЭР"]
[1,"Хуулийн этгээдийн оноосон нэр"]
[2,"Танай байгууллагын салбар, нэгжийн тоо"]
[3,"Байгууллагын албан ёсны бүртгэлтэй хаяг (өөрчлөгдсөн бол сүүлийн хаяг)"]
[4,"Үйл ажиллагаа явуулж буй албан ёсны хаяг (Дээрх бичсэнээс өөр тохиолдолд) "]
[5,"Үйл ажиллагаа явуулж буй хугацаа"]
[6,"Байгууллагын зохион байгуулалтын хэлбэр"]
["7","Олон нийтэд хувьцаагаа арилжаалдаг эсэх"]
[8,"Танай байгууллага эсвэл түүний аль нэг салбар нь өөр улсад тусгай зөвшөөрөлтэй үйл ажиллагаа явуулдаг уу?"]
["8 a","Хэрэв Тийм бол үйл ажиллагаа явуулдаг холбогдох салбар/бизнес нэгжүүдийн нэр, байршиж буй улсын мэдээллийг оруулна уу"]
["9","Танай байгууллага цахимаар үйлчилгээ үзүүлдэг үү?"]
["9 а","Хэрэв тийм бол ямар төрлийн үйлчилгээ цахимаар явуулдаг вэ? Хариултын хэсэгт дурьдана уу."]
["2. ЁС ЗҮЙН ЭРСДЭЛ"]
["2.1","Бизнесийн ёс зүй, нийгмийн хариуцлага"]
["10","Танай байгууллага \"Компанийн засаглалын кодекс\"-ийг мөрдөх үүрэг хүлээсэн бол уг кодексийн хэрэгжилтийг үнэлнэ үү."]
["11","Танай байгууллагад дараах дүрэм, журам, заавар, хөтөлбөр байдаг уу? Хэрэгжилтийг үнэлнэ үү."]
["11 a","Ёс зүйн дүрэм"]
["11 b","Комплайнсын хөтөлбөр"]
["11 c","Комплайнсын хяналтын журам, заавар"]
["11 d","Хөдөлмөрийн дотоод журам"]
["11 e","Мэдээллийн ил тод байдал, тайлагналын журам"]
["11 f","Сонирхлын зөрчлийг зохицуулах журам"]
["12","Танай байгууллага шүгэл үлээх үйл ажиллагааг зохицуулсан журам заавар, бүтэцтэй эсэх? хэрэгжилтийг үнэлнэ үү. "]
["13","Байгууллагын эрх бүхий албан тушаалтан, ажилтнуудад зориулсан сургалтын жилийн хөтөлбөрийг баталж, хэрэгжүүлдэг эсэх"]
["14","Танай байгууллага харилцагчийн мэдээллийн аюулгүй байдлыг зохицуулсан журам заавартай эсэх?"]
["2.2","Аудит ба залилан"]
["15","Танай байгууллагад төрийн хяналт, зохицуулагчийн хяналт шалгалтаас гадна байгууллагын эрсдэлийн үнэлгээ, МУТС, хээл хахууль авилга, залилангийн эсрэг үйл ажиллагаа болон хориг арга хэмжээний хэрэгжилтийг үнэлдэг чиг үүрэг бүхий нэгж, ажилтан, эсвэл хөндлөнгийн этгээд байдаг уу? Хэрэгжилтийг үнэлнэ үү."]
["16","Танай байгууллагад хээл хахууль авилга, залилантай тэмцэх бодлогын баримт бичиг, журам, заавар бий юу?   "]
["17","Танай байгууллага залилан мэхлэхийг илрүүлэх бодит цагийн хяналттай юу?"]
["18","Танай байгууллагын үйл явц нь залилангийн хяналтыг дэмжих нэмэлт мэдээлэл цуглуулдаг системтэй байдаг уу, тухайлбал: IP хаяг, GPS байршил болон/эсвэл төхөөрөмжийн ID зэрэг багтдаг уу?"]
["3. НЭР ХҮНДИЙН ЭРСДЭЛ"]
["3.1","Хээл, хахууль ба авилга"]
["19","Байгууллага нь хээл хахууль, авлигаас урьдчилан сэргийлэх, илрүүлэх, мэдээлэх зорилгоор холбогдох ХХА-ын дүрэм, шаардлагад нийцсэн бодлого, журамтай юу?"]
["20","Байгууллагын дотоод аудитын чиг үүрэг бүхий алба/нэгж эсвэл бусад бие даасан гуравдагч этгээд ХХА-ийн бодлого, журмыг давхар хянадаг уу?"]
["21","Байгууллага ХХА-ын сургалтыг дараах хүмүүст ордог уу? 1) Удирдах зөвлөл, гүйцэтгэх зөвлөлийн хороод буюу удирдах түвшиний ажилтнууд. 2) Хамгаалалтын I, II, III шугамын ажилтнууд. 3) Гуравдагч байгууллагын ажилтнууд. 4) Гэрээт ажилтнууд."]
{"$rows_left_out":98}
{"sheet":"Result_1","index":2,"n_rows":136,"n_cols":6,"rows_kept":136,"cut":false,"hidden":false,"merged":[[60,1,60,2],[81,1,81,2],[85,1,85,2],[96,1,96,2],[1,0,1,5],[3,3,3,5],[3,0,3,2],[43,1,43,2],[50,1,50,2],[6,3,16,5]]}
[]
["Хавсралт 4 : Комплайнсын эрсдэлийн нэгдсэн үнэлгээний загвар"]
[]
["Асуумж",null,null,"Байгууллагын өөрийн үнэлгээ"]
["№","Асуулт ","Хариулт","Эрсдэлийн нөлөө","Эрсдэлийн магадлал","Эрсдэлийн өөрийн үнэлгээ"]
["1. ХУУЛИЙН ЭТГЭЭД & ӨМЧИЙН ХЭЛБЭР"]
[1,"Хуулийн этгээдийн оноосон нэр",{"$f":"'Байгууллагын өөрийн үнэлгээ'!C7","v":0}]
[2,"Танай байгууллагын салбар, нэгжийн тоо",{"$f":"'Байгууллагын өөрийн үнэлгээ'!C8","v":0}]
[3,"Байгууллагын албан ёсны бүртгэлтэй хаяг (өөрчлөгдсөн бол сүүлийн хаяг)",{"$f":"'Байгууллагын өөрийн үнэлгээ'!C9","v":0}]
[4,"Үйл ажиллагаа явуулж буй албан ёсны хаяг (Дээрх бичсэнээс өөр тохиолдолд) ",{"$f":"'Байгууллагын өөрийн үнэлгээ'!C10","v":0}]
[5,"Үйл ажиллагаа явуулж буй хугацаа",{"$f":"'Байгууллагын өөрийн үнэлгээ'!C11","v":0}]
[6,"Байгууллагын зохион байгуулалтын хэлбэр",{"$f":"'Байгууллагын өөрийн үнэлгээ'!C12","v":0}]
["7","Олон нийтэд хувьцаагаа арилжаалдаг эсэх",{"$f":"'Байгууллагын өөрийн үнэлгээ'!C13","v":0}]
[8,"Танай байгууллага эсвэл түүний аль нэг салбар нь өөр улсад тусгай зөвшөөрөлтэй үйл ажиллагаа явуулдаг уу?",{"$f":"'Байгууллагын өөрийн үнэлгээ'!C14","v":0}]
["8 a","Хэрэв Тийм бол үйл ажиллагаа явуулдаг холбогдох салбар/бизнес нэгжүүдийн нэр, байршиж буй улсын мэдээллийг оруулна уу",{"$f":"'Байгууллагын өөрийн үнэлгээ'!C15","v":0}]
["9","Танай байгууллага цахимаар үйлчилгээ үзүүлдэг үү?",{"$f":"'Байгууллагын өөрийн үнэлгээ'!C16","v":0}]
["9 а","Хэрэв тийм бол ямар төрлийн үйлчилгээ цахимаар явуулдаг вэ? Хариултын хэсэгт дурьдана уу.",{"$f":"'Байгууллагын өөрийн үнэлгээ'!C17","v":0}]
["2. ЁС ЗҮЙН ЭРСДЭЛ",null,null,{"$f":"IF(SUM(D19,D31)<=1,\"N/A\",IF(SUM(D19,D31)<=3,1,IF(SUM(D19,D31)<=5,2,IF(SUM(D19,D31)<=7,3,IF(SUM(D19,D31)<=9,4,5)))))","v":"N/A"},{"$f":"IF(SUM(E19,E31)<=1,\"N/A\",IF(SUM(E19,E31)<=3,1,IF(SUM(E19,E31)<=5,2,IF(SUM(E19,E31)<=7,3,IF(SUM(E19,E31)<=9,4,5)))))","v":"N/A"},{"$f":"IFERROR(VLOOKUP(D18*E18,'Үнэлгээ тайлбар'!$B$2:$C$15,2,FALSE),\"N/A\")","v":"N/A"}]
["2.1","Бизнесийн ёс зүй, нийгмийн хариуцлага",null,{"$f":"IF(SUM(D20,D21,D28:D30)<=4,\"N/A\",IF(SUM(D20,D21,D28:D30)<=9,1,IF(SUM(D20,D21,D28:D30)<=13,2,IF(SUM(D20,D21,D28:D30)<=17,3,IF(SUM(D20,D21,D28:D30)<=21,4,IF(SUM(D20,D21,D28:D30)<=25,5,\"N/A))))\"))))))","v":"N/A"},{"$f":"IF(SUM(E20,E21,E28:E30)<=4,\"N/A\",IF(SUM(E20,E21,E28:E30)<=9,1,IF(SUM(E20,E21,E28:E30)<=13,2,IF(SUM(E20,E21,E28:E30)<=17,3,IF(SUM(E20,E21,E28:E30)<=21,4,IF(SUM(E20,E21,E28:E30)<=25,5,\"N/A))))\"))))))","v":"N/A"},{"$f":"IFERROR(VLOOKUP(D19*E19,'Үнэлгээ тайлбар'!$B$2:$C$15,2,FALSE),\"N/A\")","v":"N/A"}]
["10","Танай байгууллага \"Компанийн засаглалын кодекс\"-ийг мөрдөх үүрэг хүлээсэн бол уг кодексийн хэрэгжилтийг үнэлнэ үү?",{"$f":"'Байгууллагын өөрийн үнэлгээ'!C20","v":0},{"$f":"'Байгууллагын өөрийн үнэлгээ'!D20","v":0},{"$f":"IF(C20=\"Маш сайн\",1,IF(C20=\"Сайн\",2,IF(C20=\"Дунд\",3,IF(C20=\"Муу\",4,IF(C20=\"Огт хэрэгжүүлдэггүй\",5,0)))))","v":0},{"$f":"IFERROR(VLOOKUP(D20*E20,'Үнэлгээ тайлбар'!$B$2:$C$15,2,FALSE),\"N/A\")","v":"N/A"}]
["11","Танай байгууллага дараах бодлогын баримт бичиг, дүрэм, журам, зааврыг батлан мөрддөг эсэх? ",null,{"$f":"IF(SUM(D22:D27)<=5,\"N/A\",IF(SUM(D22:D27)<=11,1,IF(SUM(D22:D27)<=16,2,IF(SUM(D22:D27)<=20,3,IF(SUM(D22:D27)<=25,4,5)))))","v":"N/A"},{"$f":"IF(SUM(E22:E27)<=5,\"N/A\",IF(SUM(E22:E27)<=11,1,IF(SUM(E22:E27)<=16,2,IF(SUM(E22:E27)<=20,3,IF(SUM(E22:E27)<=25,4,5)))))","v":"N/A"},{"$f":"IFERROR(VLOOKUP(D21*E21,'Үнэлгээ тайлбар'!$B$2:$C$15,2,FALSE),\"N/A\")","v":"N/A"}]
["11 a","Ёс зүйн дүрэм",{"$f":"'Байгууллагын өөрийн үнэлгээ'!C22","v":0},{"$f":"'Байгууллагын өөрийн үнэлгээ'!D22","v":0},{"$f":"IF(C22=\"Байдаг. Хэрэгжилт хангалттай\",1,IF(C22=\"Байдаг ч хэрэгжилт хангалттай бус\",2,IF(C22=\"Байдаг ч сайжруулах шаардлагатай\",3,IF(C22=\"Байхгүй ч одоо боловсруулж байгаа\",4,IF(C22=\"Байдаггүй\",5,0)))))","v":0},{"$f":"IFERROR(VLOOKUP(D22*E22,'Үнэлгээ тайлбар'!$B$2:$C$15,2,FALSE),\"N/A\")","v":"N/A"}]
["11 b","Комплайнсын хөтөлбөр",{"$f":"'Байгууллагын өөрийн үнэлгээ'!C23","v":0},{"$f":"'Байгууллагын өөрийн үнэлгээ'!D23","v":0},{"$f":"IF(C23=\"Байдаг. Хэрэгжилт хангалттай\",1,IF(C23=\"Байдаг ч хэрэгжилт хангалттай бус\",2,IF(C23=\"Байдаг ч сайжруулах шаардлагатай\",3,IF(C23=\"Байхгүй ч одоо боловсруулж байгаа\",4,IF(C23=\"Байдаггүй\",5,0)))))","v":0},{"$f":"IFERROR(VLOOKUP(D23*E23,'Үнэлгээ тайлбар'!$B$2:$C$15,2,FALSE),\"N/A\")","v":"N/A"}]
["11 c","Комплайнсын хяналтын журам, заавар",{"$f":"'Байгууллагын өөрийн үнэлгээ'!C24","v":0},{"$f":"'Байгууллагын өөрийн үнэлгээ'!D24","v":0},0,{"$f":"IFERROR(VLOOKUP(D24*E24,'Үнэлгээ тайлбар'!$B$2:$C$15,2,FALSE),\"N/A\")","v":"N/A"}]
["11 d","Хөдөлмөрийн дотоод журам",{"$f":"'Байгууллагын өөрийн үнэлгээ'!C25","v":0},{"$f":"'Байгууллагын өөрийн үнэлгээ'!D25","v":0},0,{"$f":"IFERROR(VLOOKUP(D25*E25,'Үнэлгээ тайлбар'!$B$2:$C$15,2,FALSE),\"N/A\")","v":"N/A"}]
["11 e","Мэдээллийн ил тод байдал, тайлагналын журам",{"$f":"'Байгууллагын өөрийн үнэлгээ'!C26","v":0},{"$f":"'Байгууллагын өөрийн үнэлгээ'!D26","v":0},0,{"$f":"IFERROR(VLOOKUP(D26*E26,'Үнэлгээ тайлбар'!$B$2:$C$15,2,FALSE),\"N/A\")","v":"N/A"}]
["11 f","Сонирхлын зөрчлийг зохицуулах журам",{"$f":"'Байгууллагын өөрийн үнэлгээ'!C27","v":0},{"$f":"'Байгууллагын өөрийн үнэлгээ'!D27","v":0},0,{"$f":"IFERROR(VLOOKUP(D27*E27,'Үнэлгээ тайлбар'!$B$2:$C$15,2,FALSE),\"N/A\")","v":"N/A"}]
["12","Танай байгууллага шүгэл үлээх үйл ажиллагааг зохицуулсан журам заавар, бүтэцтэй эсэх? хэрэгжилтийг үнэлнэ үү. ",{"$f":"'Байгууллагын өөрийн үнэлгээ'!C28","v":0},{"$f":"'Байгууллагын өөрийн үнэлгээ'!D28","v":0},{"$f":"IF(C28=\"Маш сайн\",1,IF(C28=\"Сайн\",2,IF(C28=\"Дунд\",3,IF(C28=\"Муу\",4,IF(C28=\"Огт хэрэгжүүлдэггүй\",5,0)))))","v":0},{"$f":"IFERROR(VLOOKUP(D28*E28,'Үнэлгээ тайлбар'!$B$2:$C$15,2,FALSE),\"N/A\")","v":"N/A"}]
["13","Байгууллагын эрх бүхий албан тушаалтан, ажилтнуудад зориулсан сургалтын жилийн хөтөлбөрийг баталж, хэрэгжүүлдэг эсэх",{"$f":"'Байгууллагын өөрийн үнэлгээ'!C29","v":0},{"$f":"'Байгууллагын өөрийн үнэлгээ'!D29","v":0},0,{"$f":"IFERROR(VLOOKUP(D29*E29,'Үнэлгээ тайлбар'!$B$2:$C$15,2,FALSE),\"N/A\")","v":"N/A"}]
["14","Танай байгууллага харилцагчийн мэдээллийн аюулгүй байдлыг зохицуулсан журам заавартай эсэх?",{"$f":"'Байгууллагын өөрийн үнэлгээ'!C30","v":0},{"$f":"'Байгууллагын өөрийн үнэлгээ'!D30","v":0},0,{"$f":"IFERROR(VLOOKUP(D30*E30,'Үнэлгээ тайлбар'!$B$2:$C$15,2,FALSE),\"N/A\")","v":"N/A"}]
["2.2","Аудит ба залилан",null,{"$f":"IF(SUM(D32:D35)<=3,\"N/A\",IF(SUM(D32:D35)<=7,1,IF(SUM(D32:D35)<=10,2,IF(SUM(D32:D35)<=14,3,IF(SUM(D32:D35)<=17,4,IF(SUM(D32:D35)<=20,5,\"N/A))))\"))))))","v":"N/A"},{"$f":"IF(SUM(E32:E35)<=3,\"N/A\",IF(SUM(E32:E35)<=7,1,IF(SUM(E32:E35)<=10,2,IF(SUM(E32:E35)<=14,3,IF(SUM(E32:E35)<=17,4,IF(SUM(E32:E35)<=20,5,\"N/A))))\"))))))","v":"N/A"},{"$f":"IFERROR(VLOOKUP(D31*E31,'Үнэлгээ тайлбар'!$B$2:$C$15,2,FALSE),\"N/A\")","v":"N/A"}]
["15","Танай байгууллагад төрийн хяналт, зохицуулагчийн хяналт шалгалтаас гадна байгууллагын эрсдэлийн үнэлгээ, МУТС, хээл хахууль авилга, залилангийн эсрэг үйл ажиллагаа болон хориг арга хэмжээний хэрэгжилтийг үнэлдэг чиг үүрэг бүхий нэгж, ажилтан, эсвэл хөндлөнгийн этгээд байдаг уу? Хэрэгжилтийг үнэлнэ үү.",{"$f":"'Байгууллагын өөрийн үнэлгээ'!C32","v":0},{"$f":"'Байгууллагын өөрийн үнэлгээ'!D32","v":0},{"$f":"IF(C32=\"Байдаг. Хэрэгжилт хангалттай\",1,IF(C32=\"Байдаг ч хэрэгжилт хангалттай бус\",2,IF(C32=\"Байдаг ч сайжруулах шаардлагатай\",3,IF(C32=\"Байхгүй ч одоо боловсруулж байгаа\",4,IF(C32=\"Байдаггүй\",5,0)))))","v":0},{"$f":"IFERROR(VLOOKUP(D32*E32,'Үнэлгээ тайлбар'!$B$2:$C$15,2,FALSE),\"N/A\")","v":"N/A"}]
["16","Танай байгууллагад хээл хахууль авилга, залилантай тэмцэх бодлогын баримт бичиг, журам, заавар бий юу?   ",{"$f":"'Байгууллагын өөрийн үнэлгээ'!C33","v":0},{"$f":"'Байгууллагын өөрийн үнэлгээ'!D33","v":0},0,{"$f":"IFERROR(VLOOKUP(D33*E33,'Үнэлгээ тайлбар'!$B$2:$C$15,2,FALSE),\"N/A\")","v":"N/A"}]
["17","Танай байгууллага залилан мэхлэхийг илрүүлэх бодит цагийн хяналттай юу?",{"$f":"'Байгууллагын өөрийн үнэлгээ'!C34","v":0},{"$f":"'Байгууллагын өөрийн үнэлгээ'!D34","v":0},0,{"$f":"IFERROR(VLOOKUP(D34*E34,'Үнэлгээ тайлбар'!$B$2:$C$15,2,FALSE),\"N/A\")","v":"N/A"}]
["18","Танай байгууллагын үйл явц нь залилангийн хяналтыг дэмжих нэмэлт мэдээлэл цуглуулдаг системтэй байдаг уу, тухайлбал: IP хаяг, GPS байршил болон/эсвэл төхөөрөмжийн ID зэрэг багтдаг уу?",{"$f":"'Байгууллагын өөрийн үнэлгээ'!C35","v":0},{"$f":"'Байгууллагын өөрийн үнэлгээ'!D35","v":0},0,{"$f":"IFERROR(VLOOKUP(D35*E35,'Үнэлгээ тайлбар'!$B$2:$C$15,2,FALSE),\"N/A\")","v":"N/A"}]
["3. НЭР ХҮНДИЙН ЭРСДЭЛ",null,null,{"$f":"IF(SUM(D37:D79)<=2,\"N/A\",IF(SUM(D37:D79)<=5,1,IF(SUM(D37:D79)<=8,2,IF(SUM(D37:D79)<=10,3,IF(SUM(D37:D79)<=13,4,5)))))","v":"N/A"},{"$f":"IF(SUM(E37:E79)<=2,\"N/A\",IF(SUM(E37:E79)<=5,1,IF(SUM(E37:E79)<=8,2,IF(SUM(E37:E79)<=10,3,IF(SUM(E37:E79)<=13,4,5)))))","v":"N/A"},{"$f":"IFERROR(VLOOKUP(D36*E36,'Үнэлгээ тайлбар'!$B$2:$C$15,2,FALSE),\"N/A\")","v":"N/A"}]
["3.1","Хээл, хахууль ба авилга",null,{"$f":"IF(SUM(D38:D40)<=2,\"N/A\",IF(SUM(D38:D40)<=5,1,IF(SUM(D38:D40)<=8,2,IF(SUM(D38:D40)<=10,3,IF(SUM(D38:D40)<=13,4,IF(SUM(D38:D40)<=15,5,\"N/A))))\"))))))","v":"N/A"},{"$f":"IF(SUM(E38:E40)<=2,\"N/A\",IF(SUM(E38:E40)<=5,1,IF(SUM(E38:E40)<=8,2,IF(SUM(E38:E40)<=10,3,IF(SUM(E38:E40)<=13,4,IF(SUM(E38:E40)<=15,5,\"N/A))))\"))))))","v":"N/A"},{"$f":"IFERROR(VLOOKUP(D37*E37,'Үнэлгээ тайлбар'!$B$2:$C$15,2,FALSE),\"N/A\")","v":"N/A"}]
["19","Байгууллага нь хээл хахууль, авлигаас урьдчилан сэргийлэх, илрүүлэх, мэдээлэх зорилгоор холбогдох ХХА-ын дүрэм, шаардлагад нийцсэн бодлого, журамтай юу?",{"$f":"'Байгууллагын өөрийн үнэлгээ'!C38","v":0},{"$f":"'Байгууллагын өөрийн үнэлгээ'!D38","v":0},{"$f":"IF(C38=\"Байдаг. Хэрэгжилт хангалттай\",1,IF(C38=\"Байдаг ч хэрэгжилт хангалттай бус\",2,IF(C38=\"Байдаг ч сайжруулах шаардлагатай\",3,IF(C38=\"Байхгүй ч одоо боловсруулж байгаа\",4,IF(C38=\"Байдаггүй\",5,0)))))","v":0},{"$f":"IFERROR(VLOOKUP(D38*E38,'Үнэлгээ тайлбар'!$B$2:$C$15,2,FALSE),\"N/A\")","v":"N/A"}]
["20","Байгууллагын дотоод аудитын чиг үүрэг бүхий алба/нэгж эсвэл бусад бие даасан гуравдагч этгээд ХХА-ийн бодлого, журмыг давхар хянадаг уу?",{"$f":"'Байгууллагын өөрийн үнэлгээ'!C39","v":0},{"$f":"'Байгууллагын өөрийн үнэлгээ'!D39","v":0},{"$f":"IF(C39=\"Бүрэн\",1,IF(C39=\"Хангалттай\",2,IF(C39=\"Дунд\",3,IF(C39=\"Хангалтгүй\",4,IF(C39=\"Муу\",5,0)))))","v":0},{"$f":"IFERROR(VLOOKUP(D39*E39,'Үнэлгээ тайлбар'!$B$2:$C$15,2,FALSE),\"N/A\")","v":"N/A"}]
["21","Байгууллага ХХА-ын сургалтыг дараах хүмүүст ордог уу? 1) Удирдах зөвлөл, гүйцэтгэх зөвлөлийн хороод буюу удирдах түвшиний ажилтнууд. 2) Хамгаалалтын I, II, III шугамын ажилтнууд. 3) Гуравдагч байгууллагын ажилтнууд. 4) Гэрээт ажилтнууд.",{"$f":"'Байгууллагын өөрийн үнэлгээ'!C40","v":0},{"$f":"'Байгууллагын өөрийн үнэлгээ'!D40","v":0},{"$f":"IF(C40=\"Бүгдийг хамруулдаг\",1,IF(C40=\"Зөвхөн гурвыг нь хамруулдаг\",2,IF(C40=\"Зөвхөн хоёрыг нь хамруулдаг\",3,IF(C40=\"Зөвхөн нэгийг нь хамруулдаг\",4,IF(C40=\"Огт хамруулдаггүй\",5,0)))))","v":0},{"$f":"IFERROR(VLOOKUP(D40*E40,'Үнэлгээ тайлбар'!$B$2:$C$15,2,FALSE),\"N/A\")","v":"N/A"}]
{"$rows_left_out":97}
{"sheet":"Result_2","index":3,"n_rows":42,"n_cols":8,"rows_kept":42,"cut":false,"hidden":false,"merged":[[25,1,26,1],[23,4,23,5],[23,6,23,7],[23,3,24,3],[23,2,24,2],[36,2,37,2],[36,3,37,3],[36,4,36,5],[12,1,12,7],[14,3,14,7],[16,1,20,1],[1,1,1,7],[3,3,3,7],[5,1,9,1]]}
[]
[null,"Байгууллагын комплайнсын эрсдэлийн өөрийн үнэлгээний үр дүн"]
[]
[null,null,null,"Эрсдэлийн нөлөө "]
[null,null,null,1,2,3,4,5]
[null,"Эрсдэлийн магадлал",1,{"$f":"_xlfn.TEXTJOIN(CHAR(10),TRUE,IF(impact=D5,IF(prob=$C$6,\"🔹 \"&Title,\"\"),\"\"))","v":""},{"$f":"_xlfn.TEXTJOIN(CHAR(10),TRUE,IF(impact=E5,IF(prob=$C$6,\"🔹 \"&Title,\"\"),\"\"))","v":""},{"$f":"_xlfn.TEXTJOIN(CHAR(10),TRUE,IF(impact=F5,IF(prob=$C$6,\"🔹 \"&Title,\"\"),\"\"))","v":""},{"$f":"_xlfn.TEXTJOIN(CHAR(10),TRUE,IF(impact=G5,IF(prob=$C$6,\"🔹 \"&Title,\"\"),\"\"))","v":""},{"$f":"_xlfn.TEXTJOIN(CHAR(10),TRUE,IF(impact=H5,IF(prob=$C$6,\"🔹 \"&Title,\"\"),\"\"))","v":""}]
[null,null,2,{"$f":"_xlfn.TEXTJOIN(CHAR(10),TRUE,IF(impact=D5,IF(prob=$C$7,\"🔹 \"&Title,\"\"),\"\"))","v":""},{"$f":"_xlfn.TEXTJOIN(CHAR(10),TRUE,IF(impact=E5,IF(prob=$C$7,\"🔹 \"&Title,\"\"),\"\"))","v":""},{"$f":"_xlfn.TEXTJOIN(CHAR(10),TRUE,IF(impact=F5,IF(prob=$C$7,\"🔹 \"&Title,\"\"),\"\"))","v":""},{"$f":"_xlfn.TEXTJOIN(CHAR(10),TRUE,IF(impact=G5,IF(prob=$C$7,\"🔹 \"&Title,\"\"),\"\"))","v":""},{"$f":"_xlfn.TEXTJOIN(CHAR(10),TRUE,IF(impact=H5,IF(prob=$C$7,\"🔹 \"&Title,\"\"),\"\"))","v":""}]
[null,null,3,{"$f":"_xlfn.TEXTJOIN(CHAR(10),TRUE,IF(impact=D5,IF(prob=$C$8,\"🔹 \"&Title,\"\"),\"\"))","v":""},{"$f":"_xlfn.TEXTJOIN(CHAR(10),TRUE,IF(impact=E5,IF(prob=$C$8,\"🔹 \"&Title,\"\"),\"\"))","v":""},{"$f":"_xlfn.TEXTJOIN(CHAR(10),TRUE,IF(impact=F5,IF(prob=$C$8,\"🔹 \"&Title,\"\"),\"\"))","v":""},{"$f":"_xlfn.TEXTJOIN(CHAR(10),TRUE,IF(impact=G5,IF(prob=$C$8,\"🔹 \"&Title,\"\"),\"\"))","v":""},{"$f":"_xlfn.TEXTJOIN(CHAR(10),TRUE,IF(impact=H5,IF(prob=$C$8,\"🔹 \"&Title,\"\"),\"\"))","v":""}]
[null,null,4,{"$f":"_xlfn.TEXTJOIN(CHAR(10),TRUE,IF(impact=D5,IF(prob=$C$9,\"🔹 \"&Title,\"\"),\"\"))","v":""},{"$f":"_xlfn.TEXTJOIN(CHAR(10),TRUE,IF(impact=E5,IF(prob=$C$9,\"🔹 \"&Title,\"\"),\"\"))","v":""},{"$f":"_xlfn.TEXTJOIN(CHAR(10),TRUE,IF(impact=F5,IF(prob=$C$9,\"🔹 \"&Title,\"\"),\"\"))","v":""},{"$f":"_xlfn.TEXTJOIN(CHAR(10),TRUE,IF(impact=G5,IF(prob=$C$9,\"🔹 \"&Title,\"\"),\"\"))","v":""},{"$f":"_xlfn.TEXTJOIN(CHAR(10),TRUE,IF(impact=H5,IF(prob=$C$9,\"🔹 \"&Title,\"\"),\"\"))","v":""}]
[null,null,5,{"$f":"_xlfn.TEXTJOIN(CHAR(10),TRUE,IF(impact=D5,IF(prob=$C$10,\"🔹 \"&Title,\"\"),\"\"))","v":""},{"$f":"_xlfn.TEXTJOIN(CHAR(10),TRUE,IF(impact=E5,IF(prob=$C$10,\"🔹 \"&Title,\"\"),\"\"))","v":""},{"$f":"_xlfn.TEXTJOIN(CHAR(10),TRUE,IF(impact=F5,IF(prob=$C$10,\"🔹 \"&Title,\"\"),\"\"))","v":""},{"$f":"_xlfn.TEXTJOIN(CHAR(10),TRUE,IF(impact=G5,IF(prob=$C$10,\"🔹 \"&Title,\"\"),\"\"))","v":""},{"$f":"_xlfn.TEXTJOIN(CHAR(10),TRUE,IF(impact=H5,IF(prob=$C$10,\"🔹 \"&Title,\"\"),\"\"))","v":""}]
[]
[]
[null,"Эрсдэлийн төрлөөрх үнэлгээний үр дүн"]
[]
[null,null,null,"Эрсдэлийн нөлөө "]
[null,null,null,1,2,3,4,5]
[null,"Эрсдэлийн магадлал",1,{"$f":"_xlfn.TEXTJOIN(CHAR(10),TRUE,IF(impact3=D16,IF(prob3=$C$6,\"🔹 \"&title3,\"\"),\"\"))","v":{"$error":"#DIV/0!"}},{"$f":"_xlfn.TEXTJOIN(CHAR(10),TRUE,IF(impact3=E16,IF(prob3=$C$6,\"🔹 \"&title3,\"\"),\"\"))","v":{"$error":"#DIV/0!"}},{"$f":"_xlfn.TEXTJOIN(CHAR(10),TRUE,IF(impact3=F16,IF(prob3=$C$6,\"🔹 \"&title3,\"\"),\"\"))","v":{"$error":"#DIV/0!"}},{"$f":"_xlfn.TEXTJOIN(CHAR(10),TRUE,IF(impact3=G16,IF(prob3=$C$6,\"🔹 \"&title3,\"\"),\"\"))","v":{"$error":"#DIV/0!"}},{"$f":"_xlfn.TEXTJOIN(CHAR(10),TRUE,IF(impact3=H16,IF(prob3=$C$6,\"🔹 \"&title3,\"\"),\"\"))","v":{"$error":"#DIV/0!"}}]
[null,null,2,{"$f":"_xlfn.TEXTJOIN(CHAR(10),TRUE,IF(impact3=D16,IF(prob3=$C$7,\"🔹 \"&title3,\"\"),\"\"))","v":{"$error":"#DIV/0!"}},{"$f":"_xlfn.TEXTJOIN(CHAR(10),TRUE,IF(impact3=E16,IF(prob3=$C$7,\"🔹 \"&title3,\"\"),\"\"))","v":{"$error":"#DIV/0!"}},{"$f":"_xlfn.TEXTJOIN(CHAR(10),TRUE,IF(impact3=F16,IF(prob3=$C$7,\"🔹 \"&title3,\"\"),\"\"))","v":{"$error":"#DIV/0!"}},{"$f":"_xlfn.TEXTJOIN(CHAR(10),TRUE,IF(impact3=G16,IF(prob3=$C$7,\"🔹 \"&title3,\"\"),\"\"))","v":{"$error":"#DIV/0!"}},{"$f":"_xlfn.TEXTJOIN(CHAR(10),TRUE,IF(impact3=H16,IF(prob3=$C$7,\"🔹 \"&title3,\"\"),\"\"))","v":{"$error":"#DIV/0!"}}]
[null,null,3,{"$f":"_xlfn.TEXTJOIN(CHAR(10),TRUE,IF(impact3=D16,IF(prob3=$C$8,\"🔹 \"&title3,\"\"),\"\"))","v":{"$error":"#DIV/0!"}},{"$f":"_xlfn.TEXTJOIN(CHAR(10),TRUE,IF(impact3=E16,IF(prob3=$C$8,\"🔹 \"&title3,\"\"),\"\"))","v":{"$error":"#DIV/0!"}},{"$f":"_xlfn.TEXTJOIN(CHAR(10),TRUE,IF(impact3=F16,IF(prob3=$C$8,\"🔹 \"&title3,\"\"),\"\"))","v":{"$error":"#DIV/0!"}},{"$f":"_xlfn.TEXTJOIN(CHAR(10),TRUE,IF(impact3=G16,IF(prob3=C19,\"🔹 \"&title3,\"\"),\"\"))","v":{"$error":"#DIV/0!"}},{"$f":"_xlfn.TEXTJOIN(CHAR(10),TRUE,IF(impact3=H16,IF(prob3=$C$8,\"🔹 \"&title3,\"\"),\"\"))","v":{"$error":"#DIV/0!"}}]
[null,null,4,{"$f":"_xlfn.TEXTJOIN(CHAR(10),TRUE,IF(impact3=D16,IF(prob3=$C$9,\"🔹 \"&title3,\"\"),\"\"))","v":{"$error":"#DIV/0!"}},{"$f":"_xlfn.TEXTJOIN(CHAR(10),TRUE,IF(impact3=E16,IF(prob3=$C$9,\"🔹 \"&title3,\"\"),\"\"))","v":{"$error":"#DIV/0!"}},{"$f":"_xlfn.TEXTJOIN(CHAR(10),TRUE,IF(impact3=F16,IF(prob3=$C$9,\"🔹 \"&title3,\"\"),\"\"))","v":{"$error":"#DIV/0!"}},{"$f":"_xlfn.TEXTJOIN(CHAR(10),TRUE,IF(impact3=G16,IF(prob3=$C$9,\"🔹 \"&title3,\"\"),\"\"))","v":{"$error":"#DIV/0!"}},{"$f":"_xlfn.TEXTJOIN(CHAR(10),TRUE,IF(impact3=H16,IF(prob3=$C$9,\"🔹 \"&title3,\"\"),\"\"))","v":{"$error":"#DIV/0!"}}]
[null,null,5,{"$f":"_xlfn.TEXTJOIN(CHAR(10),TRUE,IF(impact3=D16,IF(prob3=$C$10,\"🔹 \"&title3,\"\"),\"\"))","v":{"$error":"#DIV/0!"}},{"$f":"_xlfn.TEXTJOIN(CHAR(10),TRUE,IF(impact3=E16,IF(prob3=$C$10,\"🔹 \"&title3,\"\"),\"\"))","v":{"$error":"#DIV/0!"}},{"$f":"_xlfn.TEXTJOIN(CHAR(10),TRUE,IF(impact3=F16,IF(prob3=$C$10,\"🔹 \"&title3,\"\"),\"\"))","v":{"$error":"#DIV/0!"}},{"$f":"_xlfn.TEXTJOIN(CHAR(10),TRUE,IF(impact3=G16,IF(prob3=$C$10,\"🔹 \"&title3,\"\"),\"\"))","v":{"$error":"#DIV/0!"}},{"$f":"_xlfn.TEXTJOIN(CHAR(10),TRUE,IF(impact3=H16,IF(prob3=$C$10,\"🔹 \"&title3,\"\"),\"\"))","v":{"$error":"#DIV/0!"}}]
[null,null,null,"Санхүүгийн Зохицуулах Хорооны үнэлгээний үр дүн"]
[]
[null,null,null,"Бүлэг","Байгууллагын өөрийн үнэлгээ"]
[null,null,null,null,"Эрсдэлийн үр нөлөө","Эрсдэлийн магадлал"]
[null,null,1,"Бизнесийн ёс зүй, нийгмийн хариуцлага",{"$f":"Result_1!D19","v":"N/A"},{"$f":"Result_1!E19","v":"N/A"}]
[null,null,2,"Аудит ба залилан",{"$f":"Result_1!D31","v":"N/A"},{"$f":"Result_1!E31","v":"N/A"}]
[null,null,3,"Хээл, хахууль ба авилга",{"$f":"Result_1!D37","v":"N/A"},{"$f":"Result_1!E37","v":"N/A"}]
[null,null,4,"Харилцагчийг таньж мэдэх үйл ажиллагаа",{"$f":"Result_1!D41","v":"N/A"},{"$f":"Result_1!E41","v":"N/A"}]
[null,null,5,"МУТС ба хориг арга хэмжээ, бодлогын баримт бичиг, дүрэм, журам",{"$f":"Result_1!D81","v":"N/A"},{"$f":"Result_1!E81","v":"N/A"}]
[null,null,6,"МУТС ба хориг арга хэмжээний хөтөлбөр",{"$f":"Result_1!D96","v":"N/A"},{"$f":"Result_1!E96","v":"N/A"}]
[null,null,7,"Хориг арга хэмжээ",{"$f":"Result_1!D115","v":"N/A"},{"$f":"Result_1!E115","v":"N/A"}]
[null,null,8,"Хяналт, тайлагнал",{"$f":"Result_1!D121","v":"N/A"},{"$f":"Result_1!E121","v":"N/A"}]
[null,null,9,"Төлбөрийн ил тод байдал",{"$f":"Result_1!D127","v":"N/A"},{"$f":"Result_1!E127","v":"N/A"}]
[null,null,10,"Сургалт ба мэдлэг боловсрол ",{"$f":"Result_1!D131","v":"N/A"},{"$f":"Result_1!E131","v":"N/A"}]
[]
[null,null,null,"Эрсдэл","Эрсдэлийн төрлөөрх үнэлгээ"]
[null,null,null,null,"Эрсдэлийн үр нөлөө","Эрсдэлийн магадлал"]
[null,null,1,"Ёс зүйн эрсдэл",{"$f":"ROUND(AVERAGE(E26:E27),0.5)","v":{"$error":"#DIV/0!"}},{"$f":"ROUND(AVERAGE(F26:F27),0.5)","v":{"$error":"#DIV/0!"}}]
[null,null,2,"Нэр хүндийн эрсдэл",{"$f":"ROUND(AVERAGE(E28:E29),0.5)","v":{"$error":"#DIV/0!"}},{"$f":"ROUND(AVERAGE(F28:F29),0.5)","v":{"$error":"#DIV/0!"}}]
{"$rows_left_out":3}
{"sheet":"Үнэлгээ тайлбар","index":4,"n_rows":15,"n_cols":3,"rows_kept":15,"cut":false,"hidden":true,"merged":[]}
[null,"Risk rating"]
[null,1,"1 - Бага"]
[null,2,"2 - Бага"]
[null,3,"3 - Бага"]
[null,4,"4 - Бага"]
[null,5,"5 - Дунд"]
[null,6,"6 - Дунд"]
[null,8,"8 - Дунд"]
[null,9,"9 - Дунд"]
[null,10,"10 - Их"]
[null,12,"12 - Их"]
[null,15,"15 - Их"]
[null,16,"16 - Их"]
[null,20,"20 - Анхаарах"]
[null,25,"25 - Анхаарах"]