{"text_format":"1","workbook":"xlsx","n_sheets":5,"sheets":["Зааварчилгаа","Байгууллагын өөрийн үнэлгээ","Result_1","Result_2","Үнэлгээ тайлбар"],"not_rendered":{"charts":0,"images":1,"macros":1,"external_links":0,"defined_names":10,"comments":0,"pivot_tables":0},"unopened":[],"bounds":{"document_bytes":16777216,"sheet_cells":100000,"rows_first":2000,"rows_last":500,"rows_between":2000,"halvings":0,"cell_chars":16384,"cell_head_chars":4096},"cells_cut":0,"cells_raw":0,"read":"whole","date_system":"1900"}

{"sheet":"Зааварчилгаа","index":0,"n_rows":9,"n_cols":2,"rows_kept":9,"cut":false,"hidden":false,"merged":[[0,0,0,1],[1,0,1,1]]}
["Санхүүгийн зохицуулах хорооны зохицуулалттай этгээдийн комплайнсын эрсдэлийн үнэлгээний (эксел файл) асуулгад хариулах зааварчилгаа"]
["\nКомплайнсын эрсдэлийн өөрийн үнэлгээг дараах зааварчилгааны дагуу хийнэ. Үүнд: "]
[1," Комплайнсын эрсдэлийн өөрийн үнэлгээг хийхдээ дараах зааварчилгааны дагуу эрсдэлийг тодорхойлох 10 бүлэг, 42 багц, 96 асуулт бүхий 5-6 сонголтот  хариултаас тохирохыг сонгоно."]
[2,"Асуулт бүрийн онцлогоос шалтгаалан 5-6  хувилбараас оновчтой 1 хувилбарыг сонгох боломжтой. 42 багц асуултуудын зарим хэсэг нь нарийвчилсан дэд асуултуудаас бүрдэх бөгөөд дэд асуултууд нэгтгэгдэж 1 багц хариулт, хэд хэдэн багц хариултууд нэгтгэгдэж, 1 бүлгийн үнэлгээ хийгдэж 42 багц, 10 бүлэг, 4 төрлийн багц эрсдэл үнэлэгдэнэ."]
[3,"Сонголтын хариулт бүтэн харагдахгүй тохиолдолд та тухайн хариултыг дарж бүтнээр нь унших боломжтой."]
[4," Асуулт бүр заавал сонгох хариулттай тул та аль нэг хариултыг заавал сонгох шаардлагатай. Хариултын сонголт хийгдээгүй тохиолдолд эрсдэлийн үнэлгээ хийгдэхгүй болохыг анхаарна уу."]
[5,"Асуултын хариултаас хамааран шаардлагатай тохиолдолд нэмэлт  тайлбар оруулах хэсэгт мэдээллээ оруулахыг анхаарна уу. Энэ хэсэгт сонголт хийх боломжгүй, зөвхөн мэдээлэл болон тайлбарыг бичгээр оруулна."]
[6,"Компани өөрийн өнөөгийн нөхцөл байдлыг үнэлсэн үнэлгээнд тулгуурлан, эрсдэлийн тохиолдол бий болсон үед байгууллагад үзүүлэх үр нөлөөг 1-5 (1- маш багаас, 5- маш их) оноогоор үнэлнэ. "]
[7,"Комплайнсын эрсдэлийн үр нөлөөг дараах шалгуураар үнэлнэ. Үүнд: "]

{"sheet":"Байгууллагын өөрийн үнэлгээ","index":1,"n_rows":145,"n_cols":4,"rows_kept":145,"cut":false,"hidden":false,"merged":[[1,2,1,3],[4,0,4,3],[126,0,126,2],[67,1,67,2],[144,0,146,3],[22,0,22,2],[88,1,88,2],[103,1,103,2],[92,1,92,2]]}
[]
[]
[]
[]
[" Комплайнсын эрсдэлийн өөрийн үнэлгээний асуумж"]
[]
[]
[]
[]
["№","Асуулт ","Хариулт","Эрсдэлийн үр нөлөө"]
["1. ХУУЛИЙН ЭТГЭЭД & ӨМЧИЙН ХЭЛБЭР"]
[1,"Хуулийн этгээдийн оноосон нэр"]
[2,"Салбар, нэгжийн тоо"]
[3,"Албан ёсны бүртгэлтэй хаяг (өөрчлөгдсөн бол сүүлийн хаяг)"]
[4,"Үйл ажиллагаа явуулж буй албан ёсны хаяг (Дээрх бичсэнээс өөр тохиолдолд) "]
[5,"Үйл ажиллагаа явуулж буй хугацаа"]
[6,"Зохион байгуулалтын хэлбэр"]
["7","Олон нийтэд хувьцаагаа арилжаалдаг эсэх"]
[8,"Өөр улсад тусгай зөвшөөрөлтэй үйл ажиллагаа явуулдаг уу?"]
["8 a","Хэрэв тийм бол үйл ажиллагаа явуулдаг холбогдох салбар/бизнес нэгжүүдийн нэр, байршиж буй улсын мэдээллийг оруулна уу"]
["9","Цахимаар үйлчилгээ үзүүлдэг эсэх?"]
["9 а","Хэрэв тийм бол ямар төрлийн үйлчилгээ цахимаар явуулдаг вэ? "]
["2. ЁС ЗҮЙН ЭРСДЭЛ"]
["2.1","Бизнесийн ёс зүй, нийгмийн хариуцлага"]
["10","\"Компанийн засаглалын кодекс\"-ийн хэрэгжилтийн үнэлгээ"]
["11","Дараах дүрэм, журам, заавар, хөтөлбөр байдаг уу? Хэрэгжилтийг үнэлнэ үү."]
["11 a","Ёс зүйн дүрэм"]
["11 b","Комплайнсын хөтөлбөр"]
["11 c","Комплайнсын хяналтын журам, заавар"]
["11 d","Хөдөлмөрийн дотоод журам"]
["11 e","Мэдээллийн ил тод байдал, тайлагналын журам"]
["11 f","Сонирхлын зөрчлийг зохицуулах журам"]
["11 g","Жендерийн тэгш байдлыг хангах бодлогын баримт бичиг"]
["12","Танай байгууллага шүгэл үлээх үйл ажиллагааг зохицуулсан журам заавар, бүтэцтэй эсэх? хэрэгжилтийг үнэлнэ үү. "]
["13","Байгууллагын эрх бүхий албан тушаалтан, ажилтнуудад зориулсан сургалтын жилийн хөтөлбөрийг баталж, хэрэгжүүлдэг эсэх"]
["14","Танай байгууллага харилцагчийн мэдээллийн аюулгүй байдлыг зохицуулсан журам заавартай эсэх?"]
["15","Харилцагчаас ирүүлсэн гомдлыг тухай бүр хүлээн авч шийдвэрлэдэг эсэх, хариу өгөх, хянах тогтолцоо, журамтай эсэх?"]
["2.2","Аудит ба залилан"]
["16","Танай байгууллага төрийн хяналт, зохицуулагчийн хяналт шалгалтаас гадна байгууллагын эрсдэлийн үнэлгээ, МУТС, хээл хахууль авилга, залилангийн эсрэг үйл ажиллагаа болон хориг арга хэмжээний хэрэгжилтийг үнэлдэг чиг үүрэг бүхий нэгж, ажилтан, эсхүл хөндлөнгийн этгээд байдаг уу? Хэрэгжилтийг үнэлнэ үү."]
["17","Танай байгууллагад хээл хахууль авлига, залилантай тэмцэх бодлогын баримт бичиг, журам, заавар бий юу?   "]
{"$rows_left_out":106}
{"sheet":"Result_1","index":2,"n_rows":139,"n_cols":6,"rows_kept":139,"cut":false,"hidden":false,"merged":[[62,1,62,2],[83,1,83,2],[87,1,87,2],[98,1,98,2],[1,0,1,5],[3,3,3,5],[3,0,3,2],[45,1,45,2],[52,1,52,2],[6,3,16,5]]}
[]
["Комплайнсын эрсдэлийн нэгдсэн үнэлгээ"]
[]
["Асуумж",null,null,"Байгууллагын өөрийн үнэлгээ"]
["№","Асуулт ","Хариулт","Эрсдэлийн нөлөө","Эрсдэлийн магадлал","Эрсдэлийн өөрийн үнэлгээ"]
["1. ХУУЛИЙН ЭТГЭЭД & ӨМЧИЙН ХЭЛБЭР"]
[1,"Хуулийн этгээдийн оноосон нэр",{"$f":"'Байгууллагын өөрийн үнэлгээ'!C12","v":0}]
[2,"Танай байгууллагын салбар, нэгжийн тоо",{"$f":"'Байгууллагын өөрийн үнэлгээ'!C13","v":0}]
[3,"Байгууллагын албан ёсны бүртгэлтэй хаяг (өөрчлөгдсөн бол сүүлийн хаяг)",{"$f":"'Байгууллагын өөрийн үнэлгээ'!C14","v":0}]
[4,"Үйл ажиллагаа явуулж буй албан ёсны хаяг (Дээрх бичсэнээс өөр тохиолдолд) ",{"$f":"'Байгууллагын өөрийн үнэлгээ'!C15","v":0}]
[5,"Үйл ажиллагаа явуулж буй хугацаа",{"$f":"'Байгууллагын өөрийн үнэлгээ'!C16","v":0}]
[6,"Байгууллагын зохион байгуулалтын хэлбэр",{"$f":"'Байгууллагын өөрийн үнэлгээ'!C17","v":0}]
["7","Олон нийтэд хувьцаагаа арилжаалдаг эсэх",{"$f":"'Байгууллагын өөрийн үнэлгээ'!C18","v":0}]
[8,"Танай байгууллага эсвэл түүний аль нэг салбар нь өөр улсад тусгай зөвшөөрөлтэй үйл ажиллагаа явуулдаг уу?",{"$f":"'Байгууллагын өөрийн үнэлгээ'!C19","v":0}]
["8 a","Хэрэв Тийм бол үйл ажиллагаа явуулдаг холбогдох салбар/бизнес нэгжүүдийн нэр, байршиж буй улсын мэдээллийг оруулна уу",{"$f":"'Байгууллагын өөрийн үнэлгээ'!C20","v":0}]
["9","Танай байгууллага цахимаар үйлчилгээ үзүүлдэг үү?",{"$f":"'Байгууллагын өөрийн үнэлгээ'!C21","v":0}]
["9 а","Хэрэв тийм бол ямар төрлийн үйлчилгээ цахимаар явуулдаг вэ? Хариултын хэсэгт дурьдана уу.",{"$f":"'Байгууллагын өөрийн үнэлгээ'!C22","v":0}]
["2. ЁС ЗҮЙН ЭРСДЭЛ",null,null,{"$f":"IF(SUM(D19,D33)<=1,\"N/A\",IF(SUM(D19,D33)<=3,1,IF(SUM(D19,D33)<=5,2,IF(SUM(D19,D33)<=7,3,IF(SUM(D19,D33)<=9,4,5)))))","v":"N/A"},{"$f":"IF(SUM(E19,E33)<=1,\"N/A\",IF(SUM(E19,E33)<=3,1,IF(SUM(E19,E33)<=5,2,IF(SUM(E19,E33)<=7,3,IF(SUM(E19,E33)<=9,4,5)))))","v":"N/A"},{"$f":"IFERROR(VLOOKUP(D18*E18,'Үнэлгээ тайлбар'!$B$2:$C$15,2,FALSE),\"N/A\")","v":"N/A"}]
["2.1","Бизнесийн ёс зүй, нийгмийн хариуцлага",null,{"$f":"IF(SUM(D20,D21,D29:D32)<=4,\"N/A\",IF(SUM(D20,D21,D29:D32)<=9,1,IF(SUM(D20,D21,D29:D32)<=13,2,IF(SUM(D20,D21,D29:D32)<=17,3,IF(SUM(D20,D21,D29:D32)<=21,4,IF(SUM(D20,D21,D29:D32)<=25,5,\"N/A))))\"))))))","v":"N/A"},{"$f":"IF(SUM(E20,E21,E29:E32)<=4,\"N/A\",IF(SUM(E20,E21,E29:E32)<=9,1,IF(SUM(E20,E21,E29:E32)<=13,2,IF(SUM(E20,E21,E29:E32)<=17,3,IF(SUM(E20,E21,E29:E32)<=21,4,IF(SUM(E20,E21,E29:E32)<=25,5,\"N/A))))\"))))))","v":"N/A"},{"$f":"IFERROR(VLOOKUP(D19*E19,'Үнэлгээ тайлбар'!$B$2:$C$15,2,FALSE),\"N/A\")","v":"N/A"}]
["10","Танай байгууллага \"Компанийн засаглалын кодекс\"-ийг мөрдөх үүрэг хүлээсэн бол уг кодексийн хэрэгжилтийг үнэлнэ үү?",{"$f":"'Байгууллагын өөрийн үнэлгээ'!C25","v":0},{"$f":"'Байгууллагын өөрийн үнэлгээ'!D25","v":0},{"$f":"IF(C20=\"Сайн\",1,IF(C20=\"Дунд\",2,IF(C20=\"Хангалтгүй\",3,IF(C20=\"Муу\",4,IF(C20=\"Огт хэрэгжүүлдэггүй\",5,IF(C20=\"Үүрэг хүлээгээгүй\",1,0))))))","v":0},{"$f":"IFERROR(VLOOKUP(D20*E20,'Үнэлгээ тайлбар'!$B$2:$C$15,2,FALSE),\"N/A\")","v":"N/A"}]
["11","Танай байгууллага дараах бодлогын баримт бичиг, дүрэм, журам, зааврыг батлан мөрддөг эсэх? ",null,{"$f":"IF(SUM(D22:D28)<=5,\"N/A\",IF(SUM(D22:D28)<=11,1,IF(SUM(D22:D28)<=16,2,IF(SUM(D22:D28)<=20,3,IF(SUM(D22:D28)<=25,4,5)))))","v":"N/A"},{"$f":"IF(SUM(E22:E28)<=5,\"N/A\",IF(SUM(E22:E28)<=11,1,IF(SUM(E22:E28)<=16,2,IF(SUM(E22:E28)<=20,3,IF(SUM(E22:E28)<=25,4,5)))))","v":"N/A"},{"$f":"IFERROR(VLOOKUP(D21*E21,'Үнэлгээ тайлбар'!$B$2:$C$15,2,FALSE),\"N/A\")","v":"N/A"}]
["11 a","Ёс зүйн дүрэм",{"$f":"'Байгууллагын өөрийн үнэлгээ'!C27","v":0},{"$f":"'Байгууллагын өөрийн үнэлгээ'!D27","v":0},{"$f":"IF(C22=\"Байдаг. Хэрэгжилт хангалттай\",1,IF(C22=\"Байдаг ч хэрэгжилт хангалттай бус\",2,IF(C22=\"Байдаг ч сайжруулах шаардлагатай\",3,IF(C22=\"Байхгүй ч одоо боловсруулж байгаа\",4,IF(C22=\"Байдаггүй\",5,0)))))","v":0},{"$f":"IFERROR(VLOOKUP(D22*E22,'Үнэлгээ тайлбар'!$B$2:$C$15,2,FALSE),\"N/A\")","v":"N/A"}]
["11 b","Комплайнсын хөтөлбөр",{"$f":"'Байгууллагын өөрийн үнэлгээ'!C28","v":0},{"$f":"'Байгууллагын өөрийн үнэлгээ'!D28","v":0},{"$f":"IF(C23=\"Байдаг. Хэрэгжилт хангалттай\",1,IF(C23=\"Байдаг ч хэрэгжилт хангалттай бус\",2,IF(C23=\"Байдаг ч сайжруулах шаардлагатай\",3,IF(C23=\"Байхгүй ч одоо боловсруулж байгаа\",4,IF(C23=\"Байдаггүй\",5,0)))))","v":0},{"$f":"IFERROR(VLOOKUP(D23*E23,'Үнэлгээ тайлбар'!$B$2:$C$15,2,FALSE),\"N/A\")","v":"N/A"}]
["11 c","Комплайнсын хяналтын журам, заавар",{"$f":"'Байгууллагын өөрийн үнэлгээ'!C29","v":0},{"$f":"'Байгууллагын өөрийн үнэлгээ'!D29","v":0},0,{"$f":"IFERROR(VLOOKUP(D24*E24,'Үнэлгээ тайлбар'!$B$2:$C$15,2,FALSE),\"N/A\")","v":"N/A"}]
["11 d","Хөдөлмөрийн дотоод журам",{"$f":"'Байгууллагын өөрийн үнэлгээ'!C30","v":0},{"$f":"'Байгууллагын өөрийн үнэлгээ'!D30","v":0},0,{"$f":"IFERROR(VLOOKUP(D25*E25,'Үнэлгээ тайлбар'!$B$2:$C$15,2,FALSE),\"N/A\")","v":"N/A"}]
["11 e","Мэдээллийн ил тод байдал, тайлагналын журам",{"$f":"'Байгууллагын өөрийн үнэлгээ'!C31","v":0},{"$f":"'Байгууллагын өөрийн үнэлгээ'!D31","v":0},0,{"$f":"IFERROR(VLOOKUP(D26*E26,'Үнэлгээ тайлбар'!$B$2:$C$15,2,FALSE),\"N/A\")","v":"N/A"}]
["11 f","Сонирхлын зөрчлийг зохицуулах журам",{"$f":"'Байгууллагын өөрийн үнэлгээ'!C32","v":0},{"$f":"'Байгууллагын өөрийн үнэлгээ'!D32","v":0},{"$f":"IF(C27=\"Байдаг. Хэрэгжилт хангалттай\",1,IF(C27=\"Байдаг ч хэрэгжилт хангалттай бус\",2,IF(C27=\"Байдаг ч сайжруулах шаардлагатай\",3,IF(C27=\"Байхгүй ч одоо боловсруулж байгаа\",4,IF(C27=\"Байдаггүй\",5,0)))))","v":0},{"$f":"IFERROR(VLOOKUP(D27*E27,'Үнэлгээ тайлбар'!$B$2:$C$15,2,FALSE),\"N/A\")","v":"N/A"}]
["11 g","Жендерийн тэгш байдлыг хангах бодлогын баримт бичиг",{"$f":"'Байгууллагын өөрийн үнэлгээ'!C33","v":0},{"$f":"'Байгууллагын өөрийн үнэлгээ'!D33","v":0},{"$f":"IF(C28=\"Байдаг. Хэрэгжилт хангалттай\",1,IF(C28=\"Байдаг ч хэрэгжилт хангалттай бус\",2,IF(C28=\"Байдаг ч сайжруулах шаардлагатай\",3,IF(C28=\"Байхгүй ч одоо боловсруулж байгаа\",4,IF(C28=\"Байдаггүй\",5,0)))))","v":0},{"$f":"IFERROR(VLOOKUP(D28*E28,'Үнэлгээ тайлбар'!$B$2:$C$15,2,FALSE),\"N/A\")","v":"N/A"}]
["12","Танай байгууллага шүгэл үлээх үйл ажиллагааг зохицуулсан журам заавар, бүтэцтэй эсэх? хэрэгжилтийг үнэлнэ үү. ",{"$f":"'Байгууллагын өөрийн үнэлгээ'!C34","v":0},{"$f":"'Байгууллагын өөрийн үнэлгээ'!D34","v":0},{"$f":"IF(C29=\"Маш сайн\",1,IF(C29=\"Сайн\",2,IF(C29=\"Дунд\",3,IF(C29=\"Муу\",4,IF(C29=\"Огт хэрэгжүүлдэггүй\",5,0)))))","v":0},{"$f":"IFERROR(VLOOKUP(D29*E29,'Үнэлгээ тайлбар'!$B$2:$C$15,2,FALSE),\"N/A\")","v":"N/A"}]
["13","Байгууллагын эрх бүхий албан тушаалтан, ажилтнуудад зориулсан сургалтын жилийн хөтөлбөрийг баталж, хэрэгжүүлдэг эсэх",{"$f":"'Байгууллагын өөрийн үнэлгээ'!C35","v":0},{"$f":"'Байгууллагын өөрийн үнэлгээ'!D35","v":0},0,{"$f":"IFERROR(VLOOKUP(D30*E30,'Үнэлгээ тайлбар'!$B$2:$C$15,2,FALSE),\"N/A\")","v":"N/A"}]
["14","Танай байгууллага харилцагчийн мэдээллийн аюулгүй байдлыг зохицуулсан журам заавартай эсэх?",{"$f":"'Байгууллагын өөрийн үнэлгээ'!C36","v":0},{"$f":"'Байгууллагын өөрийн үнэлгээ'!D36","v":0},0,{"$f":"IFERROR(VLOOKUP(D31*E31,'Үнэлгээ тайлбар'!$B$2:$C$15,2,FALSE),\"N/A\")","v":"N/A"}]
["15","Харилцагчаас ирүүлсэн гомдлыг тухай бүр хүлээн авч шийдвэрлэдэг эсэх, хариу өгөх, хянах тогтолцоо, журамтай эсэх?",{"$f":"'Байгууллагын өөрийн үнэлгээ'!C37","v":0},{"$f":"'Байгууллагын өөрийн үнэлгээ'!D37","v":0},0,{"$f":"IFERROR(VLOOKUP(D32*E32,'Үнэлгээ тайлбар'!$B$2:$C$15,2,FALSE),\"N/A\")","v":"N/A"}]
["2.2","Аудит ба залилан",null,{"$f":"IF(SUM(D34:D37)<=3,\"N/A\",IF(SUM(D34:D37)<=7,1,IF(SUM(D34:D37)<=10,2,IF(SUM(D34:D37)<=14,3,IF(SUM(D34:D37)<=17,4,IF(SUM(D34:D37)<=20,5,\"N/A))))\"))))))","v":"N/A"},{"$f":"IF(SUM(E34:E37)<=3,\"N/A\",IF(SUM(E34:E37)<=7,1,IF(SUM(E34:E37)<=10,2,IF(SUM(E34:E37)<=14,3,IF(SUM(E34:E37)<=17,4,IF(SUM(E34:E37)<=20,5,\"N/A))))\"))))))","v":"N/A"},{"$f":"IFERROR(VLOOKUP(D33*E33,'Үнэлгээ тайлбар'!$B$2:$C$15,2,FALSE),\"N/A\")","v":"N/A"}]
["16","Танай байгууллагад төрийн хяналт, зохицуулагчийн хяналт шалгалтаас гадна байгууллагын эрсдэлийн үнэлгээ, МУТС, хээл хахууль авилга, залилангийн эсрэг үйл ажиллагаа болон хориг арга хэмжээний хэрэгжилтийг үнэлдэг чиг үүрэг бүхий нэгж, ажилтан, эсвэл хөндлөнгийн этгээд байдаг уу? Хэрэгжилтийг үнэлнэ үү.",{"$f":"'Байгууллагын өөрийн үнэлгээ'!C39","v":0},{"$f":"'Байгууллагын өөрийн үнэлгээ'!D39","v":0},{"$f":"IF(C34=\"Байдаг. Хэрэгжилт хангалттай\",1,IF(C34=\"Байдаг ч хэрэгжилт хангалттай бус\",2,IF(C34=\"Байдаг ч сайжруулах шаардлагатай\",3,IF(C34=\"Байхгүй ч одоо боловсруулж байгаа\",4,IF(C34=\"Байдаггүй\",5,0)))))","v":0},{"$f":"IFERROR(VLOOKUP(D34*E34,'Үнэлгээ тайлбар'!$B$2:$C$15,2,FALSE),\"N/A\")","v":"N/A"}]
["17","Танай байгууллагад хээл хахууль авилга, залилантай тэмцэх бодлогын баримт бичиг, журам, заавар бий юу?   ",{"$f":"'Байгууллагын өөрийн үнэлгээ'!C40","v":0},{"$f":"'Байгууллагын өөрийн үнэлгээ'!D40","v":0},0,{"$f":"IFERROR(VLOOKUP(D35*E35,'Үнэлгээ тайлбар'!$B$2:$C$15,2,FALSE),\"N/A\")","v":"N/A"}]
["18","Танай байгууллага залилан мэхлэхийг илрүүлэх бодит цагийн хяналттай юу?",{"$f":"'Байгууллагын өөрийн үнэлгээ'!C41","v":0},{"$f":"'Байгууллагын өөрийн үнэлгээ'!D41","v":0},0,{"$f":"IFERROR(VLOOKUP(D36*E36,'Үнэлгээ тайлбар'!$B$2:$C$15,2,FALSE),\"N/A\")","v":"N/A"}]
["19","Танай байгууллагын үйл явц нь залилангийн хяналтыг дэмжих нэмэлт мэдээлэл цуглуулдаг системтэй байдаг уу, тухайлбал: IP хаяг, GPS байршил болон/эсвэл төхөөрөмжийн ID зэрэг багтдаг уу?",{"$f":"'Байгууллагын өөрийн үнэлгээ'!C42","v":0},{"$f":"'Байгууллагын өөрийн үнэлгээ'!D42","v":0},0,{"$f":"IFERROR(VLOOKUP(D37*E37,'Үнэлгээ тайлбар'!$B$2:$C$15,2,FALSE),\"N/A\")","v":"N/A"}]
["3. НЭР ХҮНДИЙН ЭРСДЭЛ",null,null,{"$f":"IF(SUM(D39:D81)<=2,\"N/A\",IF(SUM(D39:D81)<=5,1,IF(SUM(D39:D81)<=8,2,IF(SUM(D39:D81)<=10,3,IF(SUM(D39:D81)<=13,4,5)))))","v":"N/A"},{"$f":"IF(SUM(E39:E81)<=2,\"N/A\",IF(SUM(E39:E81)<=5,1,IF(SUM(E39:E81)<=8,2,IF(SUM(E39:E81)<=10,3,IF(SUM(E39:E81)<=13,4,5)))))","v":"N/A"},{"$f":"IFERROR(VLOOKUP(D38*E38,'Үнэлгээ тайлбар'!$B$2:$C$15,2,FALSE),\"N/A\")","v":"N/A"}]
["3.1","Хээл, хахууль ба авилга",null,{"$f":"IF(SUM(D40:D42)<=2,\"N/A\",IF(SUM(D40:D42)<=5,1,IF(SUM(D40:D42)<=8,2,IF(SUM(D40:D42)<=10,3,IF(SUM(D40:D42)<=13,4,IF(SUM(D40:D42)<=15,5,\"N/A))))\"))))))","v":"N/A"},{"$f":"IF(SUM(E40:E42)<=2,\"N/A\",IF(SUM(E40:E42)<=5,1,IF(SUM(E40:E42)<=8,2,IF(SUM(E40:E42)<=10,3,IF(SUM(E40:E42)<=13,4,IF(SUM(E40:E42)<=15,5,\"N/A))))\"))))))","v":"N/A"},{"$f":"IFERROR(VLOOKUP(D39*E39,'Үнэлгээ тайлбар'!$B$2:$C$15,2,FALSE),\"N/A\")","v":"N/A"}]
["20","Байгууллага нь хээл хахууль, авлигаас урьдчилан сэргийлэх, илрүүлэх, мэдээлэх зорилгоор холбогдох ХХА-ын дүрэм, шаардлагад нийцсэн бодлого, журамтай юу?",{"$f":"'Байгууллагын өөрийн үнэлгээ'!C45","v":0},{"$f":"'Байгууллагын өөрийн үнэлгээ'!D45","v":0},{"$f":"IF(C40=\"Байдаг. Хэрэгжилт хангалттай\",1,IF(C40=\"Байдаг ч хэрэгжилт хангалттай бус\",2,IF(C40=\"Байдаг ч сайжруулах шаардлагатай\",3,IF(C40=\"Байхгүй ч одоо боловсруулж байгаа\",4,IF(C40=\"Байдаггүй\",5,0)))))","v":0},{"$f":"IFERROR(VLOOKUP(D40*E40,'Үнэлгээ тайлбар'!$B$2:$C$15,2,FALSE),\"N/A\")","v":"N/A"}]
{"$rows_left_out":100}
{"sheet":"Result_2","index":3,"n_rows":42,"n_cols":8,"rows_kept":42,"cut":false,"hidden":false,"merged":[[1,1,1,7],[3,3,3,7],[5,1,9,1],[36,2,37,2],[36,3,37,3],[36,4,36,5],[12,1,12,7],[14,3,14,7],[16,1,20,1],[25,1,26,1],[23,4,23,5],[23,6,23,7],[23,3,24,3],[23,2,24,2]]}
[]
[null,"Байгууллагын комплайнсын эрсдэлийн өөрийн үнэлгээний үр дүн"]
[]
[null,null,null,"Эрсдэлийн нөлөө "]
[null,null,null,1,2,3,4,5]
[null,"Эрсдэлийн магадлал",1,{"$f":"_xlfn.TEXTJOIN(CHAR(10),TRUE,IF(impact=D5,IF(prob=$C$6,\"🔹 \"&Title,\"\"),\"\"))","v":""},{"$f":"_xlfn.TEXTJOIN(CHAR(10),TRUE,IF(impact=E5,IF(prob=$C$6,\"🔹 \"&Title,\"\"),\"\"))","v":""},{"$f":"_xlfn.TEXTJOIN(CHAR(10),TRUE,IF(impact=F5,IF(prob=$C$6,\"🔹 \"&Title,\"\"),\"\"))","v":""},{"$f":"_xlfn.TEXTJOIN(CHAR(10),TRUE,IF(impact=G5,IF(prob=$C$6,\"🔹 \"&Title,\"\"),\"\"))","v":""},{"$f":"_xlfn.TEXTJOIN(CHAR(10),TRUE,IF(impact=H5,IF(prob=$C$6,\"🔹 \"&Title,\"\"),\"\"))","v":""}]
[null,null,2,{"$f":"_xlfn.TEXTJOIN(CHAR(10),TRUE,IF(impact=D5,IF(prob=$C$7,\"🔹 \"&Title,\"\"),\"\"))","v":""},{"$f":"_xlfn.TEXTJOIN(CHAR(10),TRUE,IF(impact=E5,IF(prob=$C$7,\"🔹 \"&Title,\"\"),\"\"))","v":""},{"$f":"_xlfn.TEXTJOIN(CHAR(10),TRUE,IF(impact=F5,IF(prob=$C$7,\"🔹 \"&Title,\"\"),\"\"))","v":""},{"$f":"_xlfn.TEXTJOIN(CHAR(10),TRUE,IF(impact=G5,IF(prob=$C$7,\"🔹 \"&Title,\"\"),\"\"))","v":""},{"$f":"_xlfn.TEXTJOIN(CHAR(10),TRUE,IF(impact=H5,IF(prob=$C$7,\"🔹 \"&Title,\"\"),\"\"))","v":""}]
[null,null,3,{"$f":"_xlfn.TEXTJOIN(CHAR(10),TRUE,IF(impact=D5,IF(prob=$C$8,\"🔹 \"&Title,\"\"),\"\"))","v":""},{"$f":"_xlfn.TEXTJOIN(CHAR(10),TRUE,IF(impact=E5,IF(prob=$C$8,\"🔹 \"&Title,\"\"),\"\"))","v":""},{"$f":"_xlfn.TEXTJOIN(CHAR(10),TRUE,IF(impact=F5,IF(prob=$C$8,\"🔹 \"&Title,\"\"),\"\"))","v":""},{"$f":"_xlfn.TEXTJOIN(CHAR(10),TRUE,IF(impact=G5,IF(prob=$C$8,\"🔹 \"&Title,\"\"),\"\"))","v":""},{"$f":"_xlfn.TEXTJOIN(CHAR(10),TRUE,IF(impact=H5,IF(prob=$C$8,\"🔹 \"&Title,\"\"),\"\"))","v":""}]
[null,null,4,{"$f":"_xlfn.TEXTJOIN(CHAR(10),TRUE,IF(impact=D5,IF(prob=$C$9,\"🔹 \"&Title,\"\"),\"\"))","v":""},{"$f":"_xlfn.TEXTJOIN(CHAR(10),TRUE,IF(impact=E5,IF(prob=$C$9,\"🔹 \"&Title,\"\"),\"\"))","v":""},{"$f":"_xlfn.TEXTJOIN(CHAR(10),TRUE,IF(impact=F5,IF(prob=$C$9,\"🔹 \"&Title,\"\"),\"\"))","v":""},{"$f":"_xlfn.TEXTJOIN(CHAR(10),TRUE,IF(impact=G5,IF(prob=$C$9,\"🔹 \"&Title,\"\"),\"\"))","v":""},{"$f":"_xlfn.TEXTJOIN(CHAR(10),TRUE,IF(impact=H5,IF(prob=$C$9,\"🔹 \"&Title,\"\"),\"\"))","v":""}]
[null,null,5,{"$f":"_xlfn.TEXTJOIN(CHAR(10),TRUE,IF(impact=D5,IF(prob=$C$10,\"🔹 \"&Title,\"\"),\"\"))","v":""},{"$f":"_xlfn.TEXTJOIN(CHAR(10),TRUE,IF(impact=E5,IF(prob=$C$10,\"🔹 \"&Title,\"\"),\"\"))","v":""},{"$f":"_xlfn.TEXTJOIN(CHAR(10),TRUE,IF(impact=F5,IF(prob=$C$10,\"🔹 \"&Title,\"\"),\"\"))","v":""},{"$f":"_xlfn.TEXTJOIN(CHAR(10),TRUE,IF(impact=G5,IF(prob=$C$10,\"🔹 \"&Title,\"\"),\"\"))","v":""},{"$f":"_xlfn.TEXTJOIN(CHAR(10),TRUE,IF(impact=H5,IF(prob=$C$10,\"🔹 \"&Title,\"\"),\"\"))","v":""}]
[]
[]
[null,"Эрсдэлийн төрлөөрх үнэлгээний үр дүн"]
[]
[null,null,null,"Эрсдэлийн нөлөө "]
[null,null,null,1,2,3,4,5]
[null,"Эрсдэлийн магадлал",1,{"$f":"_xlfn.TEXTJOIN(CHAR(10),TRUE,IF(impact3=D16,IF(prob3=$C$6,\"🔹 \"&title3,\"\"),\"\"))","v":{"$error":"#DIV/0!"}},{"$f":"_xlfn.TEXTJOIN(CHAR(10),TRUE,IF(impact3=E16,IF(prob3=$C$6,\"🔹 \"&title3,\"\"),\"\"))","v":{"$error":"#DIV/0!"}},{"$f":"_xlfn.TEXTJOIN(CHAR(10),TRUE,IF(impact3=F16,IF(prob3=$C$6,\"🔹 \"&title3,\"\"),\"\"))","v":{"$error":"#DIV/0!"}},{"$f":"_xlfn.TEXTJOIN(CHAR(10),TRUE,IF(impact3=G16,IF(prob3=$C$6,\"🔹 \"&title3,\"\"),\"\"))","v":{"$error":"#DIV/0!"}},{"$f":"_xlfn.TEXTJOIN(CHAR(10),TRUE,IF(impact3=H16,IF(prob3=$C$6,\"🔹 \"&title3,\"\"),\"\"))","v":{"$error":"#DIV/0!"}}]
[null,null,2,{"$f":"_xlfn.TEXTJOIN(CHAR(10),TRUE,IF(impact3=D16,IF(prob3=$C$7,\"🔹 \"&title3,\"\"),\"\"))","v":{"$error":"#DIV/0!"}},{"$f":"_xlfn.TEXTJOIN(CHAR(10),TRUE,IF(impact3=E16,IF(prob3=$C$7,\"🔹 \"&title3,\"\"),\"\"))","v":{"$error":"#DIV/0!"}},{"$f":"_xlfn.TEXTJOIN(CHAR(10),TRUE,IF(impact3=F16,IF(prob3=$C$7,\"🔹 \"&title3,\"\"),\"\"))","v":{"$error":"#DIV/0!"}},{"$f":"_xlfn.TEXTJOIN(CHAR(10),TRUE,IF(impact3=G16,IF(prob3=$C$7,\"🔹 \"&title3,\"\"),\"\"))","v":{"$error":"#DIV/0!"}},{"$f":"_xlfn.TEXTJOIN(CHAR(10),TRUE,IF(impact3=H16,IF(prob3=$C$7,\"🔹 \"&title3,\"\"),\"\"))","v":{"$error":"#DIV/0!"}}]
[null,null,3,{"$f":"_xlfn.TEXTJOIN(CHAR(10),TRUE,IF(impact3=D16,IF(prob3=$C$8,\"🔹 \"&title3,\"\"),\"\"))","v":{"$error":"#DIV/0!"}},{"$f":"_xlfn.TEXTJOIN(CHAR(10),TRUE,IF(impact3=E16,IF(prob3=$C$8,\"🔹 \"&title3,\"\"),\"\"))","v":{"$error":"#DIV/0!"}},{"$f":"_xlfn.TEXTJOIN(CHAR(10),TRUE,IF(impact3=F16,IF(prob3=$C$8,\"🔹 \"&title3,\"\"),\"\"))","v":{"$error":"#DIV/0!"}},{"$f":"_xlfn.TEXTJOIN(CHAR(10),TRUE,IF(impact3=G16,IF(prob3=C19,\"🔹 \"&title3,\"\"),\"\"))","v":{"$error":"#DIV/0!"}},{"$f":"_xlfn.TEXTJOIN(CHAR(10),TRUE,IF(impact3=H16,IF(prob3=$C$8,\"🔹 \"&title3,\"\"),\"\"))","v":{"$error":"#DIV/0!"}}]
[null,null,4,{"$f":"_xlfn.TEXTJOIN(CHAR(10),TRUE,IF(impact3=D16,IF(prob3=$C$9,\"🔹 \"&title3,\"\"),\"\"))","v":{"$error":"#DIV/0!"}},{"$f":"_xlfn.TEXTJOIN(CHAR(10),TRUE,IF(impact3=E16,IF(prob3=$C$9,\"🔹 \"&title3,\"\"),\"\"))","v":{"$error":"#DIV/0!"}},{"$f":"_xlfn.TEXTJOIN(CHAR(10),TRUE,IF(impact3=F16,IF(prob3=$C$9,\"🔹 \"&title3,\"\"),\"\"))","v":{"$error":"#DIV/0!"}},{"$f":"_xlfn.TEXTJOIN(CHAR(10),TRUE,IF(impact3=G16,IF(prob3=$C$9,\"🔹 \"&title3,\"\"),\"\"))","v":{"$error":"#DIV/0!"}},{"$f":"_xlfn.TEXTJOIN(CHAR(10),TRUE,IF(impact3=H16,IF(prob3=$C$9,\"🔹 \"&title3,\"\"),\"\"))","v":{"$error":"#DIV/0!"}}]
[null,null,5,{"$f":"_xlfn.TEXTJOIN(CHAR(10),TRUE,IF(impact3=D16,IF(prob3=$C$10,\"🔹 \"&title3,\"\"),\"\"))","v":{"$error":"#DIV/0!"}},{"$f":"_xlfn.TEXTJOIN(CHAR(10),TRUE,IF(impact3=E16,IF(prob3=$C$10,\"🔹 \"&title3,\"\"),\"\"))","v":{"$error":"#DIV/0!"}},{"$f":"_xlfn.TEXTJOIN(CHAR(10),TRUE,IF(impact3=F16,IF(prob3=$C$10,\"🔹 \"&title3,\"\"),\"\"))","v":{"$error":"#DIV/0!"}},{"$f":"_xlfn.TEXTJOIN(CHAR(10),TRUE,IF(impact3=G16,IF(prob3=$C$10,\"🔹 \"&title3,\"\"),\"\"))","v":{"$error":"#DIV/0!"}},{"$f":"_xlfn.TEXTJOIN(CHAR(10),TRUE,IF(impact3=H16,IF(prob3=$C$10,\"🔹 \"&title3,\"\"),\"\"))","v":{"$error":"#DIV/0!"}}]
[null,null,null,"Санхүүгийн Зохицуулах Хорооны үнэлгээний үр дүн"]
[]
[null,null,null,"Бүлэг","  Байгууллагын өөрийн үнэлгээ"]
[null,null,null,null,"Эрсдэлийн үр нөлөө","Эрсдэлийн магадлал"]
[null,null,1,"Бизнесийн ёс зүй, нийгмийн хариуцлага",{"$f":"Result_1!D19","v":"N/A"},{"$f":"Result_1!E19","v":"N/A"}]
[null,null,2,"Аудит ба залилан",{"$f":"Result_1!D33","v":"N/A"},{"$f":"Result_1!E33","v":"N/A"}]
[null,null,3,"Хээл, хахууль ба авилга",{"$f":"Result_1!D39","v":"N/A"},{"$f":"Result_1!E39","v":"N/A"}]
[null,null,4,"Харилцагчийг таньж мэдэх үйл ажиллагаа",{"$f":"Result_1!D43","v":"N/A"},{"$f":"Result_1!E43","v":"N/A"}]
[null,null,5,"МУТС ба хориг арга хэмжээ, бодлогын баримт бичиг, дүрэм, журам",{"$f":"Result_1!D83","v":"N/A"},{"$f":"Result_1!E83","v":"N/A"}]
[null,null,6,"МУТС ба хориг арга хэмжээний хөтөлбөр",{"$f":"Result_1!D98","v":"N/A"},{"$f":"Result_1!E98","v":"N/A"}]
[null,null,7,"Хориг арга хэмжээ",{"$f":"Result_1!D117","v":"N/A"},{"$f":"Result_1!E117","v":"N/A"}]
[null,null,8,"Хяналт, тайлагнал",{"$f":"Result_1!D123","v":"N/A"},{"$f":"Result_1!E123","v":"N/A"}]
[null,null,9,"Төлбөрийн ил тод байдал",{"$f":"Result_1!D130","v":"N/A"},{"$f":"Result_1!E130","v":"N/A"}]
[null,null,10,"Сургалт ба мэдлэг боловсрол ",{"$f":"Result_1!D134","v":"N/A"},{"$f":"Result_1!E134","v":"N/A"}]
[]
[null,null,null,"Эрсдэл","Эрсдэлийн төрлөөрх үнэлгээ"]
[null,null,null,null,"Эрсдэлийн үр нөлөө","Эрсдэлийн магадлал"]
[null,null,1,"Ёс зүйн эрсдэл",{"$f":"ROUND(AVERAGE(E26:E27),0.5)","v":{"$error":"#DIV/0!"}},{"$f":"ROUND(AVERAGE(F26:F27),0.5)","v":{"$error":"#DIV/0!"}}]
[null,null,2,"Нэр хүндийн эрсдэл",{"$f":"ROUND(AVERAGE(E28:E29),0.5)","v":{"$error":"#DIV/0!"}},{"$f":"ROUND(AVERAGE(F28:F29),0.5)","v":{"$error":"#DIV/0!"}}]
{"$rows_left_out":3}
{"sheet":"Үнэлгээ тайлбар","index":4,"n_rows":15,"n_cols":3,"rows_kept":15,"cut":false,"hidden":true,"merged":[]}
[null,"Risk rating"]
[null,1,"1 - Бага"]
[null,2,"2 - Бага"]
[null,3,"3 - Бага"]
[null,4,"4 - Бага"]
[null,5,"5 - Дунд"]
[null,6,"6 - Дунд"]
[null,8,"8 - Дунд"]
[null,9,"9 - Дунд"]
[null,10,"10 - Их"]
[null,12,"12 - Их"]
[null,15,"15 - Их"]
[null,16,"16 - Их"]
[null,20,"20 - Анхаарах"]
[null,25,"25 - Анхаарах"]